Reaction Details
TargetSigma non-opioid intracellular receptor 1
LigandBDBM50421894
Substrate/Competitorn/a
Meas. Tech.ChEBML_201733
IC50 2.1±n/a nM
Citation Russell, MGBaker, RBillington, DCKnight, AKMiddlemiss, DNNoble, AJ Benz[f]isoquinoline analogues as high-affinity sigma ligands. J Med Chem35:2025-33 (1992) Sigma non-opioid intracellular receptor 1
Name:Sigma non-opioid intracellular receptor 1
Type:Enzyme Catalytic Domain
Mol. Mass.:25124.85
Organism:Homo sapiens (Human)
Description:Q99720
Residue:223
BDBM50421894
NameBDBM50421894
Synonyms:CHEMBL555581
TypeSmall organic molecule
Emp. Form.C18H27N
Mol. Mass.257.4137
SMILESCCCCN1CCC2C(C1)CCCc1ccccc21