Reaction Details
TargetSigma non-opioid intracellular receptor 1
LigandBDBM50421906
Substrate/Competitorn/a
Meas. Tech.ChEBML_201733
IC50 1.2±n/a nM
Citation Russell, MGBaker, RBillington, DCKnight, AKMiddlemiss, DNNoble, AJ Benz[f]isoquinoline analogues as high-affinity sigma ligands. J Med Chem35:2025-33 (1992) Sigma non-opioid intracellular receptor 1
Name:Sigma non-opioid intracellular receptor 1
Type:Enzyme Catalytic Domain
Mol. Mass.:25124.85
Organism:Homo sapiens (Human)
Description:Q99720
Residue:223
BDBM50421906
NameBDBM50421906
Synonyms:CHEMBL544281
TypeSmall organic molecule
Emp. Form.C18H25N
Mol. Mass.255.3978
SMILES[#6]\[#6](-[#6])=[#6]/[#6]-[#7]-1-[#6]-[#6]-[#6@@H]-2-[#6@@H](-[#6]-[#6]-c3ccccc-23)-[#6]-1