Reaction Details
TargetSigma non-opioid intracellular receptor 1
LigandBDBM50421940
Substrate/Competitorn/a
Meas. Tech.ChEBML_201732
IC50 1.0±n/a nM
Citation Chambers, MSBaker, RBillington, DCKnight, AKMiddlemiss, DNWong, EH Spiropiperidines as high-affinity, selective sigma ligands. J Med Chem35:2033-9 (1992) Sigma non-opioid intracellular receptor 1
Name:Sigma non-opioid intracellular receptor 1
Type:Enzyme Catalytic Domain
Mol. Mass.:25124.85
Organism:Homo sapiens (Human)
Description:Q99720
Residue:223
BDBM50421940
NameBDBM50421940
Synonyms:CHEMBL62770
TypeSmall organic molecule
Emp. Form.C19H27N
Mol. Mass.269.4244
SMILES[#6]\[#6](-[#6])=[#6]\[#6]-[#7]-1-[#6]-[#6]C2([#6]-[#6]-[#6]-c3ccccc23)[#6]-[#6]-1