Reaction Details
TargetHistamine H2 receptor
LigandBDBM22881
Substrate/Competitorn/a
Meas. Tech.ChEBML_85509
Kd 5012±n/a nM
Citation Eriks, JCvan der Goot, HSterk, GJTimmerman, H Histamine H2-receptor agonists. Synthesis, in vitro pharmacology, and qualitative structure-activity relationships of substituted 4- and 5-(2-aminoethyl)thiazoles. J Med Chem35:3239-46 (1992) Histamine H2 receptor
Name:Histamine H2 receptor
Type:G Protein-Coupled Receptor (GPCR)
Mol. Mass.:40567.22
Organism:Cavia porcellus (domestic guinea pig)
Description:For the H2 receptor-binding assays, guinea pig striatum was used.
Residue:359
BDBM22881
NameBDBM22881
Synonyms:5-(2-aminoethyl)-4-methyl-1,3-thiazol-2-amine CHEMBL554964
TypeSmall organic molecule
Emp. Form.C6H11N3S
Mol. Mass.157.237
SMILESCc1nc(N)sc1CCN