Reaction Details
TargetBeta-1 adrenergic receptor
LigandBDBM82482
Substrate/Competitorn/a
Meas. Tech.ChEMBL_37105 (CHEMBL650945)
Ki 76±n/a nM
Citation Markovich, KMTantishaiyakul, VHamada, AMiller, DDRomstedt, KJShams, GShin, YFraundorfer, PFDoyle, KFeller, DR Synthesis of halogenated trimetoquinol derivatives and evaluation of their beta-agonist and thromboxane A2 (TXA2) antagonist activities. J Med Chem35:466-79 (1992) Beta-1 adrenergic receptor
Name:Beta-1 adrenergic receptor
Type:Enzyme Catalytic Domain
Mol. Mass.:50540.48
Organism:GUINEA PIG
Description:adrenergic Beta1 ADRB1 GUINEA PIG::B0FL73
Residue:467
BDBM82482
NameBDBM82482
Synonyms:TMQ, S-(+)-8-Fluoro
TypeSmall organic molecule
Emp. Form.C19H22FNO5
Mol. Mass.363.3801
SMILESCOc1cc(C[C@@H]2NCCc3cc(O)c(O)c(F)c23)cc(OC)c1OC