Reaction Details
TargetCholecystokinin receptor type A
LigandBDBM21147
Substrate/Competitorn/a
Meas. Tech.ChEMBL_49889 (CHEMBL661731)
IC50 1.3±n/a nM
Citation Willson, TMHenke, BRMomtahen, TMMyers, PLSugg, EEUnwalla, RJCroom, DKDougherty, RWGrizzle, MKJohnson, MFQueen, KLRimele, TJYingling, JDJames, MK 3-[2-(N-phenylacetamide)]-1,5-benzodiazepines: orally active, binding selective CCK-A agonists. J Med Chem39:3030-4 (1996) 
 
Cholecystokinin receptor type A
Name:Cholecystokinin receptor type A
Type:G Protein-Coupled Receptor (GPCR)
Mol. Mass.:47859.34
Organism:Homo sapiens (Human)
Description:Stable expression of human CCK-1 receptors in HEK 293 cells.
Residue:428
BDBM21147
NameBDBM21147
Synonyms:(3S)-3-[(2S)-2-[(2S)-2-{2-[(2S)-2-[(2S)-2-[(3S)-3-amino-3-formamidopropanoic acid]-3-[4-(sulfooxy)phenyl]propanamido]-4-(methylsulfanyl)butanamido]acetamido}-3-(1H-indol-3-yl)propanamido]-4-(methylsulfanyl)butanamido]-3-{[(1S)-1-carbamoyl-2-phenylethyl]carbamoyl}propanoic acid CCK-8(SO3) H-Asp-Tyr(SO3H)-Met-Gly-Trp-Met-Asp-Phe-NH2 Syncalide | [125I]CCK-8
Typeradiolabeled ligand
Emp. Form.C49H62N10O16S3
Mol. Mass.1143.269
SMILESCSCC[C@H](NC(=O)[C@H](Cc1ccc(OS(O)(=O)=O)cc1)NC(=O)[C@@H](N)CC(O)=O)C(=O)NCC(=O)N[C@@H](Cc1c[nH]c2ccccc12)C(=O)N[C@@H](CCSC)C(=O)N[C@@H](CC(O)=O)C(=O)N[C@@H](Cc1ccccc1)C(N)=O