Reaction Details
TargetReverse transcriptase/RNaseH
LigandBDBM1288
Substrate/Competitorn/a
Meas. Tech.ChEMBL_196348 (CHEMBL802044)
IC50 457±n/a nM
Citation Gibson, SMcGuire, RRees, DC Principal components describing biological activities and molecular diversity of heterocyclic aromatic ring fragments. J Med Chem39:4065-72 (1996) 
 
Reverse transcriptase/RNaseH
Name:Reverse transcriptase/RNaseH
Type:PROTEIN
Mol. Mass.:65229.15
Organism:Human immunodeficiency virus 1
Description:ChEMBL_1473730
Residue:566
BDBM1288
NameBDBM1288
Synonyms:3-Aminopyridin-2(1H)-one analogue 8 CHEMBL318730 | Pyridinone deriv. 10
TypeSmall organic molecule
Emp. Form.C19H20N2O
Mol. Mass.292.3749
SMILESCCc1cc(NCc2ccc3ccccc3c2)c(=O)[nH]c1C