Reaction Details
TargetVoltage-dependent L-type calcium channel subunit alpha-1D
LigandBDBM50029417
Substrate/Competitorn/a
Meas. Tech.ChEMBL_92799 (CHEMBL703977)
IC50 0.43±n/a nM
Citation Corelli, FManetti, FTafi, ACampiani, GNacci, VBotta, M Diltiazem-like calcium entry blockers: a hypothesis of the receptor-binding site based on a comparative molecular field analysis model. J Med Chem40:125-31 (1997) 
 
Voltage-dependent L-type calcium channel subunit alpha-1D
Name:Voltage-dependent L-type calcium channel subunit alpha-1D
Type:PROTEIN
Mol. Mass.:250148.41
Organism:Rattus norvegicus
Description:ChEMBL_44709
Residue:2203
BDBM50029417
NameBDBM50029417
Synonyms:CHEMBL277363 | [4-(4-Methoxy-phenyl)-4H-benzo[b]pyrrolo[1,2-d][1,4]thiazin-1-ylmethyl]-dimethyl-amine
TypeSmall organic molecule
Emp. Form.C21H22N2OS
Mol. Mass.350.477
SMILESCOc1ccc(cc1)C1Sc2ccccc2-n2c(CN(C)C)ccc12