Reaction Details
TargetVoltage-dependent L-type calcium channel subunit alpha-1D
LigandBDBM50422200
Substrate/Competitorn/a
Meas. Tech.ChEMBL_92799 (CHEMBL703977)
IC50 3.3±n/a nM
Citation Corelli, FManetti, FTafi, ACampiani, GNacci, VBotta, M Diltiazem-like calcium entry blockers: a hypothesis of the receptor-binding site based on a comparative molecular field analysis model. J Med Chem40:125-31 (1997) 
 
Voltage-dependent L-type calcium channel subunit alpha-1D
Name:Voltage-dependent L-type calcium channel subunit alpha-1D
Type:PROTEIN
Mol. Mass.:250148.41
Organism:Rattus norvegicus
Description:ChEMBL_44709
Residue:2203
BDBM50422200
NameBDBM50422200
Synonyms:CHEMBL278804
TypeSmall organic molecule
Emp. Form.C24H25ClN2O3S
Mol. Mass.456.985
SMILESCOc1ccc(cc1)[C@@H]1Sc2ccc(Cl)cc2-n2c(CN(C)C)ccc2[C@@H]1OC(C)=O