Reaction Details
TargetVoltage-dependent L-type calcium channel subunit alpha-1D
LigandBDBM50280077
Substrate/Competitorn/a
Meas. Tech.ChEMBL_92799 (CHEMBL703977)
IC50 15±n/a nM
Citation Corelli, FManetti, FTafi, ACampiani, GNacci, VBotta, M Diltiazem-like calcium entry blockers: a hypothesis of the receptor-binding site based on a comparative molecular field analysis model. J Med Chem40:125-31 (1997) 
 
Voltage-dependent L-type calcium channel subunit alpha-1D
Name:Voltage-dependent L-type calcium channel subunit alpha-1D
Type:PROTEIN
Mol. Mass.:250148.41
Organism:Rattus norvegicus
Description:ChEMBL_44709
Residue:2203
BDBM50280077
NameBDBM50280077
Synonyms:CHEMBL18988 | sec-Butyl-[4-(2,4-dimethoxy-phenyl)-4H-benzo[b]pyrrolo[1,2-d][1,4]thiazin-1-ylmethyl]-amine
TypeSmall organic molecule
Emp. Form.C24H28N2O2S
Mol. Mass.408.556
SMILESCCC(C)NCc1ccc2C(Sc3ccccc3-n12)c1ccc(OC)cc1OC