Reaction Details
TargetEndothelin-1 receptor
LigandBDBM50422257
Substrate/Competitorn/a
Meas. Tech.ChEMBL_65664 (CHEMBL677091)
IC50 16±n/a nM
Citation Bradbury, RHBath, CButlin, RJDennis, MHeys, CHunt, SJJames, RMortlock, AASumner, NFTang, EKTelford, BWhiting, EWilson, C New non-peptide endothelin-A receptor antagonists: synthesis, biological properties, and structure-activity relationships of 5-(dimethylamino)-N-pyridyl-,-N-pyrimidinyl-,-N-pyridazinyl-, and -N-pyrazinyl-1-naphthalenesulfonamides. J Med Chem40:996-1004 (1997) 
 
Endothelin-1 receptor
Name:Endothelin-1 receptor
Type:Enzyme Catalytic Domain
Mol. Mass.:48736.88
Organism:Homo sapiens (Human)
Description:P25101
Residue:427
BDBM50422257
NameBDBM50422257
Synonyms:CHEMBL6555
TypeSmall organic molecule
Emp. Form.C16H15BrN4O3S
Mol. Mass.423.284
SMILESCNc1cccc2c(cccc12)S(=O)(=O)Nc1ncc(Br)nc1OC