Reaction Details
TargetCholinesterase
LigandBDBM50067482
Substrate/Competitorn/a
Meas. Tech.ChEMBL_41557 (CHEMBL857083)
IC50 11749±n/a nM
Citation Bolognesi, MLAndrisano, VBartolini, MMinarini, ARosini, MTumiatti, VMelchiorre, C Hexahydrochromeno[4,3-b]pyrrole derivatives as acetylcholinesterase inhibitors. J Med Chem44:105-9 (2001) Cholinesterase
Name:Cholinesterase
Type:Homotetramer
Mol. Mass.:68422.27
Organism:Homo sapiens (Human)
Description:P06276
Residue:602
BDBM50067482
NameBDBM50067482
Synonyms:6-[(2-Methoxy-benzyl)-methyl-amino]-hexanoic acid [8-({6-[(2-methoxy-benzyl)-methyl-amino]-hexanoyl}-methyl-amino)-octyl]-methyl-amide CHEMBL11805 CHEMBL557586 | N,N''-(octane-1,8-diyl)bis(6-((2-methoxybenzyl)(methyl)amino)-N-methylhexanamide)
TypeSmall organic molecule
Emp. Form.C40H66N4O4
Mol. Mass.666.9764
SMILESCOc1ccccc1CN(C)CCCCCC(=O)N(C)CCCCCCCCN(C)C(=O)CCCCCN(C)Cc1ccccc1OC