Reaction Details
TargetAcetylcholinesterase
LigandBDBM50422360
Substrate/Competitorn/a
Meas. Tech.ChEMBL_28897 (CHEMBL638446)
IC50 9772±n/a nM
Citation Bolognesi, MLAndrisano, VBartolini, MMinarini, ARosini, MTumiatti, VMelchiorre, C Hexahydrochromeno[4,3-b]pyrrole derivatives as acetylcholinesterase inhibitors. J Med Chem44:105-9 (2001) Acetylcholinesterase
Name:Acetylcholinesterase
Type:Enzyme
Mol. Mass.:67792.70
Organism:Homo sapiens (Human)
Description:P22303
Residue:614
BDBM50422360
NameBDBM50422360
Synonyms:CHEMBL2113719
TypeSmall organic molecule
Emp. Form.C42H62N4O4
Mol. Mass.686.9661
SMILESO=C(CCCCCCC(=O)NCCCCCCN1CC[C@H]2COc3ccccc3[C@@H]12)NCCCCCCN1CC[C@H]2COc3ccccc3[C@@H]12