Reaction Details
TargetAcetylcholinesterase
LigandBDBM50422361
Substrate/Competitorn/a
Meas. Tech.ChEMBL_28897 (CHEMBL638446)
IC50 16218±n/a nM
Citation Bolognesi, MLAndrisano, VBartolini, MMinarini, ARosini, MTumiatti, VMelchiorre, C Hexahydrochromeno[4,3-b]pyrrole derivatives as acetylcholinesterase inhibitors. J Med Chem44:105-9 (2001) Acetylcholinesterase
Name:Acetylcholinesterase
Type:Enzyme
Mol. Mass.:67792.70
Organism:Homo sapiens (Human)
Description:P22303
Residue:614
BDBM50422361
NameBDBM50422361
Synonyms:CHEMBL11514
TypeSmall organic molecule
Emp. Form.C14H18N2O3
Mol. Mass.262.3043
SMILESCNC(=O)Oc1ccc2OC[C@@H]3CCN(C)[C@@H]3c2c1