Reaction Details
TargetCholinesterase
LigandBDBM50422362
Substrate/Competitorn/a
Meas. Tech.ChEMBL_41557 (CHEMBL857083)
IC50 2951±n/a nM
Citation Bolognesi, MLAndrisano, VBartolini, MMinarini, ARosini, MTumiatti, VMelchiorre, C Hexahydrochromeno[4,3-b]pyrrole derivatives as acetylcholinesterase inhibitors. J Med Chem44:105-9 (2001) Cholinesterase
Name:Cholinesterase
Type:Homotetramer
Mol. Mass.:68422.27
Organism:Homo sapiens (Human)
Description:P06276
Residue:602
BDBM50422362
NameBDBM50422362
Synonyms:CHEMBL12324
TypeSmall organic molecule
Emp. Form.C15H21N2O3
Mol. Mass.277.3383
SMILESCNC(=O)Oc1ccc2[C@@H]3[C@@H](CC[N+]3(C)C)COc2c1