Reaction Details
TargetAmine oxidase [flavin-containing] B
LigandBDBM50282510
Substrate/Competitorn/a
Meas. Tech.ChEMBL_124419 (CHEMBL733083)
IC50 2.6±n/a nM
Citation Brühlmann, COoms, FCarrupt, PATesta, BCatto, MLeonetti, FAltomare, CCarotti, A Coumarins derivatives as dual inhibitors of acetylcholinesterase and monoamine oxidase. J Med Chem44:3195-8 (2001) Amine oxidase [flavin-containing] B
Name:Amine oxidase [flavin-containing] B
Type:Enzyme
Mol. Mass.:58469.65
Organism:Rattus norvegicus (rat)
Description:P19643
Residue:520
BDBM50282510
NameBDBM50282510
Synonyms:7-(4-Chloro-benzyloxy)-3,4-dimethyl-chromen-2-one CHEMBL274030
TypeSmall organic molecule
Emp. Form.C18H15ClO3
Mol. Mass.314.763
SMILESCc1c(C)c(=O)oc2cc(OCc3ccc(Cl)cc3)ccc12