Reaction Details
TargetAmine oxidase [flavin-containing] B
LigandBDBM50409109
Substrate/Competitorn/a
Meas. Tech.ChEMBL_124419 (CHEMBL733083)
IC50 3.0±n/a nM
Citation Brühlmann, COoms, FCarrupt, PATesta, BCatto, MLeonetti, FAltomare, CCarotti, A Coumarins derivatives as dual inhibitors of acetylcholinesterase and monoamine oxidase. J Med Chem44:3195-8 (2001) Amine oxidase [flavin-containing] B
Name:Amine oxidase [flavin-containing] B
Type:Enzyme
Mol. Mass.:58469.65
Organism:Rattus norvegicus (rat)
Description:P19643
Residue:520
BDBM50409109
NameBDBM50409109
Synonyms:CHEMBL108928
TypeSmall organic molecule
Emp. Form.C18H14F2O3
Mol. Mass.316.2988
SMILESCc1c(C)c(=O)oc2cc(OCc3cc(F)cc(F)c3)ccc12