Reaction Details
TargetIntegrin alpha-4/beta-1
LigandBDBM50115175
Substrate/Competitorn/a
Meas. Tech.ChEMBL_213396 (CHEMBL818054)
IC50 2300±n/a nM
Citation Singh, JVan Vlijmen, HLiao, YLee, WCCornebise, MHarris, MShu, IHGill, ACuervo, JHAbraham, WMAdams, SP Identification of potent and novel alpha4beta1 antagonists using in silico screening. J Med Chem45:2988-93 (2002) Integrin alpha-4/beta-1
Name:Integrin alpha-4/beta-1
Type:n/a
Mol. Mass.:n/a
Description:ASSAY_ID of EBI is 88912
Components:This complex has 2 components.
Component 1
Name:Integrin beta-1
Synonyms:CD_antigen=CD29 Fibronectin receptor beta GPIIA ITGB1 MDF2 | MSK12
Type:Enzyme
Mol. Mass.:88400.38
Organism:Homo sapiens (Human)
Description:P05556
Residue:798
Component 2
Name:Integrin alpha-4
Synonyms:CD49 antigen-like family member D CD49d antigen ITA4_HUMAN Integrin alpha-4 Integrin alpha-IV VLA-4 integrin alpha 4 precursor | integrin alpha-4 precursor
Type:Membrane Protein
Mol. Mass.:114897.35
Organism:Homo sapiens (Human)
Description:P13612
Residue:1032
BDBM50115175
NameBDBM50115175
Synonyms:(5-{2-[4-(3-o-Tolyl-ureido)-phenyl]-acetylamino}-[1,3,4]thiadiazol-2-ylsulfanyl)-acetic acid | CHEMBL441464
TypeSmall organic molecule
Emp. Form.C20H19N5O4S2
Mol. Mass.457.526
SMILESCc1ccccc1NC(=O)Nc1ccc(CC(=O)Nc2nnc(SCC(O)=O)s2)cc1