Reaction Details
TargetFarnesyl pyrophosphate synthase
LigandBDBM50422441
Substrate/Competitorn/a
Meas. Tech.ChEMBL_194806 (CHEMBL799889)
IC50 7.1±n/a nM
Citation Kotsikorou, EOldfield, E A quantitative structure-activity relationship and pharmacophore modeling investigation of aryl-X and heterocyclic bisphosphonates as bone resorption agents. J Med Chem46:2932-44 (2003) 
 
Farnesyl pyrophosphate synthase
Name:Farnesyl pyrophosphate synthase
Type:Enzyme
Mol. Mass.:48272.89
Organism:Homo sapiens (Human)
Description:P14324
Residue:419
BDBM50422441
NameBDBM50422441
Synonyms:CHEMBL101539
TypeSmall organic molecule
Emp. Form.C12H16N2O6P2S
Mol. Mass.378.278
SMILESOP(O)(=O)C(Nc1ncc(CCc2ccccc2)s1)P(O)(O)=O