Reaction Details
TargetFarnesyl pyrophosphate synthase
LigandBDBM50422453
Substrate/Competitorn/a
Meas. Tech.ChEMBL_194806 (CHEMBL799889)
IC50 18±n/a nM
Citation Kotsikorou, EOldfield, E A quantitative structure-activity relationship and pharmacophore modeling investigation of aryl-X and heterocyclic bisphosphonates as bone resorption agents. J Med Chem46:2932-44 (2003) 
 
Farnesyl pyrophosphate synthase
Name:Farnesyl pyrophosphate synthase
Type:Enzyme
Mol. Mass.:48272.89
Organism:Homo sapiens (Human)
Description:P14324
Residue:419
BDBM50422453
NameBDBM50422453
Synonyms:CHEMBL323300
TypeSmall organic molecule
Emp. Form.C5H11N3O6P2
Mol. Mass.271.1049
SMILESCn1ccnc1NC(P(O)(O)=O)P(O)(O)=O