Reaction Details
TargetFarnesyl pyrophosphate synthase
LigandBDBM50422456
Substrate/Competitorn/a
Meas. Tech.ChEMBL_194806 (CHEMBL799889)
IC50 18±n/a nM
Citation Kotsikorou, EOldfield, E A quantitative structure-activity relationship and pharmacophore modeling investigation of aryl-X and heterocyclic bisphosphonates as bone resorption agents. J Med Chem46:2932-44 (2003) 
 
Farnesyl pyrophosphate synthase
Name:Farnesyl pyrophosphate synthase
Type:Enzyme
Mol. Mass.:48272.89
Organism:Homo sapiens (Human)
Description:P14324
Residue:419
BDBM50422456
NameBDBM50422456
Synonyms:CHEMBL100232
TypeSmall organic molecule
Emp. Form.C12H21NO7P2S
Mol. Mass.385.31
SMILESOC(CCNCCCSc1ccccc1)(P(O)(O)=O)P(O)(O)=O