Reaction Details
TargetFarnesyl pyrophosphate synthase
LigandBDBM50422459
Substrate/Competitorn/a
Meas. Tech.ChEMBL_194806 (CHEMBL799889)
IC50 72±n/a nM
Citation Kotsikorou, EOldfield, E A quantitative structure-activity relationship and pharmacophore modeling investigation of aryl-X and heterocyclic bisphosphonates as bone resorption agents. J Med Chem46:2932-44 (2003) 
 
Farnesyl pyrophosphate synthase
Name:Farnesyl pyrophosphate synthase
Type:Enzyme
Mol. Mass.:48272.89
Organism:Homo sapiens (Human)
Description:P14324
Residue:419
BDBM50422459
NameBDBM50422459
Synonyms:CHEMBL101717
TypeSmall organic molecule
Emp. Form.C14H25NO8P2
Mol. Mass.397.2977
SMILESCCN(CCCOc1ccccc1)CCC(O)(P(O)(O)=O)P(O)(O)=O