Reaction Details
TargetFarnesyl pyrophosphate synthase
LigandBDBM50422469
Substrate/Competitorn/a
Meas. Tech.ChEMBL_194806 (CHEMBL799889)
IC50 1.4±n/a nM
Citation Kotsikorou, EOldfield, E A quantitative structure-activity relationship and pharmacophore modeling investigation of aryl-X and heterocyclic bisphosphonates as bone resorption agents. J Med Chem46:2932-44 (2003) 
 
Farnesyl pyrophosphate synthase
Name:Farnesyl pyrophosphate synthase
Type:Enzyme
Mol. Mass.:48272.89
Organism:Homo sapiens (Human)
Description:P14324
Residue:419
BDBM50422469
NameBDBM50422469
Synonyms:CHEMBL101472
TypeSmall organic molecule
Emp. Form.C13H22FNO8P2
Mol. Mass.401.2616
SMILESCN(CCCOc1ccc(F)cc1)CCC(O)(P(O)(O)=O)P(O)(O)=O