Reaction Details
TargetFarnesyl pyrophosphate synthase
LigandBDBM50422474
Substrate/Competitorn/a
Meas. Tech.ChEMBL_194806 (CHEMBL799889)
IC50 39±n/a nM
Citation Kotsikorou, EOldfield, E A quantitative structure-activity relationship and pharmacophore modeling investigation of aryl-X and heterocyclic bisphosphonates as bone resorption agents. J Med Chem46:2932-44 (2003) 
 
Farnesyl pyrophosphate synthase
Name:Farnesyl pyrophosphate synthase
Type:Enzyme
Mol. Mass.:48272.89
Organism:Homo sapiens (Human)
Description:P14324
Residue:419
BDBM50422474
NameBDBM50422474
Synonyms:CHEMBL321075
TypeSmall organic molecule
Emp. Form.C14H25NO7P2
Mol. Mass.381.2983
SMILESCCN(CCCc1ccccc1)CCC(O)(P(O)(O)=O)P(O)(O)=O