Reaction Details
TargetFarnesyl pyrophosphate synthase
LigandBDBM50422475
Substrate/Competitorn/a
Meas. Tech.ChEMBL_194806 (CHEMBL799889)
IC50 5.0±n/a nM
Citation Kotsikorou, EOldfield, E A quantitative structure-activity relationship and pharmacophore modeling investigation of aryl-X and heterocyclic bisphosphonates as bone resorption agents. J Med Chem46:2932-44 (2003) 
 
Farnesyl pyrophosphate synthase
Name:Farnesyl pyrophosphate synthase
Type:Enzyme
Mol. Mass.:48272.89
Organism:Homo sapiens (Human)
Description:P14324
Residue:419
BDBM50422475
NameBDBM50422475
Synonyms:CHEMBL98703
TypeSmall organic molecule
Emp. Form.C7H14N2O7P2
Mol. Mass.300.1428
SMILESCc1ncn(CC(O)(P(O)(O)=O)P(O)(O)=O)c1C