Reaction Details
TargetFarnesyl pyrophosphate synthase
LigandBDBM50422477
Substrate/Competitorn/a
Meas. Tech.ChEMBL_194806 (CHEMBL799889)
IC50 5.1±n/a nM
Citation Kotsikorou, EOldfield, E A quantitative structure-activity relationship and pharmacophore modeling investigation of aryl-X and heterocyclic bisphosphonates as bone resorption agents. J Med Chem46:2932-44 (2003) 
 
Farnesyl pyrophosphate synthase
Name:Farnesyl pyrophosphate synthase
Type:Enzyme
Mol. Mass.:48272.89
Organism:Homo sapiens (Human)
Description:P14324
Residue:419
BDBM50422477
NameBDBM50422477
Synonyms:CHEMBL317646
TypeSmall organic molecule
Emp. Form.C6H12N2O7P2
Mol. Mass.286.1162
SMILESCc1nc[nH]c1CC(O)(P(O)(O)=O)P(O)(O)=O