Reaction Details
TargetMuscarinic acetylcholine receptor M4
LigandBDBM50003359
Substrate/Competitorn/a
Meas. Tech.ChEMBL_139238 (CHEMBL857188)
IC50 25±n/a nM
Citation Cao, YZhang, MWu, CLee, SWroblewski, MEWhipple, TNagy, PITakács-Novák, KBalázs, ATorös, SMesser, WS Synthesis and biological characterization of 1-methyl-1,2,5,6-tetrahydropyridyl-1,2,5-thiadiazole derivatives as muscarinic agonists for the treatment of neurological disorders. J Med Chem46:4273-86 (2003) 
 
Muscarinic acetylcholine receptor M4
Name:Muscarinic acetylcholine receptor M4
Type:Enzyme Catalytic Domain
Mol. Mass.:53079.31
Organism:Homo sapiens (Human)
Description:Cholinergic, muscarinic M4 CHRM4 HUMAN M3::P08173
Residue:479
BDBM50003359
NameBDBM50003359
Synonyms:5-(4-Hexyloxy-[1,2,5]thiadiazol-3-yl)-1-methyl-1,2,3,6-tetrahydro-pyridine; oxalic acid CHEMBL21536 LY 246708 | Xanomeline
TypeSmall organic molecule
Emp. Form.C14H23N3OS
Mol. Mass.281.417
SMILESCCCCCCOc1nsnc1C1=CCCN(C)C1