Reaction Details
TargetHistamine H1 receptor
LigandBDBM22567
Substrate/Competitorn/a
Meas. Tech.ChEMBL_84547 (CHEMBL692983)
IC50 13±n/a nM
Citation Govoni, MBakker, RAvan de Wetering, ISmit, MJMenge, WMTimmerman, HElz, SSchunack, WLeurs, R Synthesis and pharmacological identification of neutral histamine H1-receptor antagonists. J Med Chem46:5812-24 (2003) 
 
Histamine H1 receptor
Name:Histamine H1 receptor
Type:G Protein-Coupled Receptor (GPCR)
Mol. Mass.:55808.72
Organism:Homo sapiens (Human)
Description:Cell pellets from SK-N-MC cells transfected with human H1 receptor were used in binding assay.
Residue:487
BDBM22567
NameBDBM22567
Synonyms:3H]pyrilamine Dorantamin N-(4-methoxybenzyl)-N ,N -dimethyl-N-pyridin-2-ylethane-1,2-diamine PYRILAMINE [3H]mepyramine | [3H]pyrilamine
Typeradiolabeled ligand
Emp. Form.C17H23N3O
Mol. Mass.285.384
SMILESCOc1ccc(CN(CCN(C)C)c2ccccn2)cc1