Reaction Details
TargetHistamine H1 receptor
LigandBDBM7966
Substrate/Competitorn/a
Meas. Tech.ChEMBL_84547 (CHEMBL692983)
IC50 158±n/a nM
Citation Govoni, MBakker, RAvan de Wetering, ISmit, MJMenge, WMTimmerman, HElz, SSchunack, WLeurs, R Synthesis and pharmacological identification of neutral histamine H1-receptor antagonists. J Med Chem46:5812-24 (2003) 
 
Histamine H1 receptor
Name:Histamine H1 receptor
Type:G Protein-Coupled Receptor (GPCR)
Mol. Mass.:55808.72
Organism:Homo sapiens (Human)
Description:Cell pellets from SK-N-MC cells transfected with human H1 receptor were used in binding assay.
Residue:487
BDBM7966
NameBDBM7966
Synonyms:2-(1H-imidazol-4-yl)ethan-1-amine CHEMBL90 Ergotidine Histamine Peremin | [3H]histamine
TypeSmall organic molecule
Emp. Form.C5H9N3
Mol. Mass.111.1451
SMILESNCCc1cnc[nH]1