Reaction Details
TargetPotassium voltage-gated channel subfamily H member 2
LigandBDBM50449636
Substrate/Competitorn/a
Meas. Tech.ChEMBL_307283 (CHEMBL832278)
IC50 3802±n/a nM
Citation Rajamani, RTounge, BALi, JReynolds, CH A two-state homology model of the hERG K+ channel: application to ligand binding. Bioorg Med Chem Lett15:1737-41 (2005) 
 
Potassium voltage-gated channel subfamily H member 2
Name:Potassium voltage-gated channel subfamily H member 2
Type:Multi-pass membrane protein
Mol. Mass.:126672.65
Organism:Homo sapiens (Human)
Description:Q12809
Residue:1159
BDBM50449636
NameBDBM50449636
Synonyms:BRL-43694 Kytril Sancuso
TypeSmall organic molecule
Emp. Form.C18H24N4O
Mol. Mass.312.4094
SMILES[H][C@]12CCC[C@]([H])(C[C@H](C1)NC(=O)c1nn(C)c3ccccc13)N2C