Reaction Details
TargetPotassium voltage-gated channel subfamily H member 2
LigandBDBM50001786
Substrate/Competitorn/a
Meas. Tech.ChEMBL_307282 (CHEMBL832277)
IC50 14±n/a nM
Citation Rajamani, RTounge, BALi, JReynolds, CH A two-state homology model of the hERG K+ channel: application to ligand binding. Bioorg Med Chem Lett15:1737-41 (2005) 
 
Potassium voltage-gated channel subfamily H member 2
Name:Potassium voltage-gated channel subfamily H member 2
Type:Multi-pass membrane protein
Mol. Mass.:126672.65
Organism:Homo sapiens (Human)
Description:Q12809
Residue:1159
BDBM50001786
NameBDBM50001786
Synonyms:1-(2-{4-[5-chloro-1-(4-fluorophenyl)-1H-indol-3-yl]piperidin-1-yl}ethyl)imidazolidin-2-one CHEMBL12713 | Sertindole
TypeSmall organic molecule
Emp. Form.C24H26ClFN4O
Mol. Mass.440.941
SMILESFc1ccc(cc1)-n1cc(C2CCN(CCN3CCNC3=O)CC2)c2cc(Cl)ccc12