Reaction Details
TargetReverse transcriptase/RNaseH
LigandBDBM1765
Substrate/Competitorn/a
Meas. Tech.ChEMBL_307251 (CHEMBL829157)
IC50 9772±n/a nM
Citation Sciabola, SCarosati, EBaroni, MMannhold, R Comparison of ligand-based and structure-based 3D-QSAR approaches: a case study on (aryl-)bridged 2-aminobenzonitriles inhibiting HIV-1 reverse transcriptase. J Med Chem48:3756-67 (2005) 
 
Reverse transcriptase/RNaseH
Name:Reverse transcriptase/RNaseH
Type:PROTEIN
Mol. Mass.:65229.15
Organism:Human immunodeficiency virus 1
Description:ChEMBL_1473730
Residue:566
BDBM1765
NameBDBM1765
Synonyms:2-Amino-6-arylthiobenzonitrile deriv. 2j CHEMBL294212
TypeSmall organic molecule
Emp. Form.C14H9N3OS
Mol. Mass.267.306
SMILESNc1cccc(c1C#N)S(=O)c1ccccc1C#N