Reaction Details
TargetReverse transcriptase/RNaseH
LigandBDBM1753
Substrate/Competitorn/a
Meas. Tech.ChEMBL_307251 (CHEMBL829157)
IC50 141±n/a nM
Citation Sciabola, SCarosati, EBaroni, MMannhold, R Comparison of ligand-based and structure-based 3D-QSAR approaches: a case study on (aryl-)bridged 2-aminobenzonitriles inhibiting HIV-1 reverse transcriptase. J Med Chem48:3756-67 (2005) 
 
Reverse transcriptase/RNaseH
Name:Reverse transcriptase/RNaseH
Type:PROTEIN
Mol. Mass.:65229.15
Organism:Human immunodeficiency virus 1
Description:ChEMBL_1473730
Residue:566
BDBM1753
NameBDBM1753
Synonyms:2-Amino-6-arylthiobenzonitrile deriv. 1w | 2-amino-6-[(3-methoxy-5-methylphenyl)sulfanyl]benzonitrile
TypeSmall organic molecule
Emp. Form.C15H14N2OS
Mol. Mass.270.349
SMILESCOc1cc(C)cc(Sc2cccc(N)c2C#N)c1