Reaction Details
TargetReverse transcriptase/RNaseH
LigandBDBM2484
Substrate/Competitorn/a
Meas. Tech.ChEMBL_307251 (CHEMBL829157)
IC50 15849±n/a nM
Citation Sciabola, SCarosati, EBaroni, MMannhold, R Comparison of ligand-based and structure-based 3D-QSAR approaches: a case study on (aryl-)bridged 2-aminobenzonitriles inhibiting HIV-1 reverse transcriptase. J Med Chem48:3756-67 (2005) 
 
Reverse transcriptase/RNaseH
Name:Reverse transcriptase/RNaseH
Type:PROTEIN
Mol. Mass.:65229.15
Organism:Human immunodeficiency virus 1
Description:ChEMBL_1473730
Residue:566
BDBM2484
NameBDBM2484
Synonyms:1-(benzenesulfonyl)-2-nitrobenzene 2NO2Ph-SO2-Ph
TypeSmall organic molecule
Emp. Form.C12H9NO4S
Mol. Mass.263.269
SMILES[O-][N+](=O)c1ccccc1S(=O)(=O)c1ccccc1