Reaction Details
TargetReverse transcriptase/RNaseH
LigandBDBM1804
Substrate/Competitorn/a
Meas. Tech.ChEMBL_307251 (CHEMBL829157)
IC50 5.0±n/a nM
Citation Sciabola, SCarosati, EBaroni, MMannhold, R Comparison of ligand-based and structure-based 3D-QSAR approaches: a case study on (aryl-)bridged 2-aminobenzonitriles inhibiting HIV-1 reverse transcriptase. J Med Chem48:3756-67 (2005) 
 
Reverse transcriptase/RNaseH
Name:Reverse transcriptase/RNaseH
Type:PROTEIN
Mol. Mass.:65229.15
Organism:Human immunodeficiency virus 1
Description:ChEMBL_1473730
Residue:566
BDBM1804
NameBDBM1804
Synonyms:2-Amino-6-arylthiobenzonitrile deriv. 3x | 2-amino-6-[(3-chloro-5-methylbenzene)sulfonyl]benzonitrile
TypeSmall organic molecule
Emp. Form.C14H11ClN2O2S
Mol. Mass.306.767
SMILESCc1cc(Cl)cc(c1)S(=O)(=O)c1cccc(N)c1C#N