Reaction Details
TargetReverse transcriptase/RNaseH
LigandBDBM1791
Substrate/Competitorn/a
Meas. Tech.ChEMBL_307251 (CHEMBL829157)
IC50 12023±n/a nM
Citation Sciabola, SCarosati, EBaroni, MMannhold, R Comparison of ligand-based and structure-based 3D-QSAR approaches: a case study on (aryl-)bridged 2-aminobenzonitriles inhibiting HIV-1 reverse transcriptase. J Med Chem48:3756-67 (2005) 
 
Reverse transcriptase/RNaseH
Name:Reverse transcriptase/RNaseH
Type:PROTEIN
Mol. Mass.:65229.15
Organism:Human immunodeficiency virus 1
Description:ChEMBL_1473730
Residue:566
BDBM1791
NameBDBM1791
Synonyms:2-Amino-6-arylthiobenzonitrile deriv. 3k | 2-amino-6-[(2-bromobenzene)sulfonyl]benzonitrile
TypeSmall organic molecule
Emp. Form.C13H9BrN2O2S
Mol. Mass.337.192
SMILESNc1cccc(c1C#N)S(=O)(=O)c1ccccc1Br