Reaction Details
TargetBeta-1 adrenergic receptor
LigandBDBM50422862
Substrate/Competitorn/a
Meas. Tech.ChEMBL_362745 (CHEMBL868152)
Kd 0.063100±n/a nM
Citation Rezmann-Vitti, LANero, TLJackman, GPMachida, CADuke, BJLouis, WJLouis, SN Role of Tyr(356(7.43)) and Ser(190(4.57)) in antagonist binding in the rat beta1-adrenergic receptor. J Med Chem49:3467-77 (2006) 
 
Beta-1 adrenergic receptor
Name:Beta-1 adrenergic receptor
Type:Protein
Mol. Mass.:50486.84
Organism:Rattus norvegicus (Rat)
Description:P18090
Residue:466
BDBM50422862
NameBDBM50422862
Synonyms:125I-CYP | CHEMBL210309
TypeSmall organic molecule
Emp. Form.C16H20IN3O2
Mol. Mass.413.2534
SMILESCC(C)(C)NCC(O)COc1cccc2[nH]c(C#N)c(I)c12