Reaction Details
TargetPeroxisome proliferator-activated receptor gamma
LigandBDBM50423008
Substrate/Competitorn/a
Meas. Tech.ChEMBL_438960 (CHEMBL889304)
Ki 251±n/a nM
Citation Trump, RPCobb, JEShearer, BGLambert, MHNolte, RTWillson, TMBuckholz, RGZhao, SMLeesnitzer, LMIannone, MAPearce, KHBillin, ANHoekstra, WJ Co-crystal structure guided array synthesis of PPARgamma inverse agonists. Bioorg Med Chem Lett17:3916-20 (2007) 
 
Peroxisome proliferator-activated receptor gamma
Name:Peroxisome proliferator-activated receptor gamma
Type:Nuclear Receptor
Mol. Mass.:57613.46
Organism:Homo sapiens (Human)
Description:P37231
Residue:505
BDBM50423008
NameBDBM50423008
Synonyms:CHEMBL230804
TypeSmall organic molecule
Emp. Form.C47H47N3O6S
Mol. Mass.781.958
SMILESCc1oc(nc1CCOc1ccc(C[C@@H](CNC(=O)CCc2ccc(SC(C)(C)C(O)=O)cc2)Nc2ccccc2C(=O)c2ccccc2)cc1)-c1ccccc1