Reaction Details
TargetPeroxisome proliferator-activated receptor gamma
LigandBDBM50002858
Substrate/Competitorn/a
Meas. Tech.ChEMBL_438960 (CHEMBL889304)
Ki 145±n/a nM
Citation Trump, RPCobb, JEShearer, BGLambert, MHNolte, RTWillson, TMBuckholz, RGZhao, SMLeesnitzer, LMIannone, MAPearce, KHBillin, ANHoekstra, WJ Co-crystal structure guided array synthesis of PPARgamma inverse agonists. Bioorg Med Chem Lett17:3916-20 (2007) 
 
Peroxisome proliferator-activated receptor gamma
Name:Peroxisome proliferator-activated receptor gamma
Type:Nuclear Receptor
Mol. Mass.:57613.46
Organism:Homo sapiens (Human)
Description:P37231
Residue:505
BDBM50002858
NameBDBM50002858
Synonyms:CHEMBL230524
TypeSmall organic molecule
Emp. Form.C41H43N3O6
Mol. Mass.673.7966
SMILESCC(CC(C)C(=O)NC[C@H](Cc1ccc(OCCc2nc(oc2C)-c2ccccc2)cc1)Nc1ccccc1C(=O)c1ccccc1)C(O)=O