Reaction Details
TargetPeroxisome proliferator-activated receptor gamma
LigandBDBM50423009
Substrate/Competitorn/a
Meas. Tech.ChEMBL_438962 (CHEMBL889305)
IC50 2512±n/a nM
Citation Trump, RPCobb, JEShearer, BGLambert, MHNolte, RTWillson, TMBuckholz, RGZhao, SMLeesnitzer, LMIannone, MAPearce, KHBillin, ANHoekstra, WJ Co-crystal structure guided array synthesis of PPARgamma inverse agonists. Bioorg Med Chem Lett17:3916-20 (2007) 
 
Peroxisome proliferator-activated receptor gamma
Name:Peroxisome proliferator-activated receptor gamma
Type:Nuclear Receptor
Mol. Mass.:57613.46
Organism:Homo sapiens (Human)
Description:P37231
Residue:505
BDBM50423009
NameBDBM50423009
Synonyms:CHEMBL230731
TypeSmall organic molecule
Emp. Form.C38H37N3O4
Mol. Mass.599.7181
SMILESCc1oc(nc1CCOc1ccc(C[C@@H](CNC(=O)C2CC2)Nc2ccccc2C(=O)c2ccccc2)cc1)-c1ccccc1