Reaction Details
TargetC3a anaphylatoxin chemotactic receptor
LigandBDBM50423085
Substrate/Competitorn/a
Meas. Tech.ChEMBL_444282 (CHEMBL894522)
IC50 5012±n/a nM
Citation Denonne, FBinet, SBurton, MCollart, PDefays, SDipesa, AEckert, MGiannaras, AKumar, SLevine, BNicolas, JMPasau, PPégurier, CPreda, DVan houtvin, NVolosov, AZou, D Discovery of new C3aR ligands. Part 2: amino-piperidine derivatives. Bioorg Med Chem Lett17:3262-5 (2007) 
 
C3a anaphylatoxin chemotactic receptor
Name:C3a anaphylatoxin chemotactic receptor
Type:PROTEIN
Mol. Mass.:53864.66
Organism:Homo sapiens (Human)
Description:ChEMBL_642034
Residue:482
BDBM50423085
NameBDBM50423085
Synonyms:CHEMBL390036 CHEMBL535625
TypeSmall organic molecule
Emp. Form.C27H35N3O2
Mol. Mass.433.5857
SMILESO=C(CCc1cccnc1)N1CCC(CC1)NC(=O)C(C1CCCCC1)c1ccccc1