Reaction Details
TargetC3a anaphylatoxin chemotactic receptor
LigandBDBM50423097
Substrate/Competitorn/a
Meas. Tech.ChEMBL_444282 (CHEMBL894522)
IC50 50±n/a nM
Citation Denonne, FBinet, SBurton, MCollart, PDefays, SDipesa, AEckert, MGiannaras, AKumar, SLevine, BNicolas, JMPasau, PPégurier, CPreda, DVan houtvin, NVolosov, AZou, D Discovery of new C3aR ligands. Part 2: amino-piperidine derivatives. Bioorg Med Chem Lett17:3262-5 (2007) 
 
C3a anaphylatoxin chemotactic receptor
Name:C3a anaphylatoxin chemotactic receptor
Type:PROTEIN
Mol. Mass.:53864.66
Organism:Homo sapiens (Human)
Description:ChEMBL_642034
Residue:482
BDBM50423097
NameBDBM50423097
Synonyms:CHEMBL438129
TypeSmall organic molecule
Emp. Form.C27H32ClN3O2
Mol. Mass.466.015
SMILESClc1cccc(c1)C(C1CCCC=C1)C(=O)NC1CCN(CC1)C(=O)CCc1cccnc1