Reaction Details
TargetLanosterol synthase
LigandBDBM50130788
Substrate/Competitorn/a
Meas. Tech.ChEMBL_446074 (CHEMBL895169)
IC50 4.1±n/a nM
Citation Caron, GErmondi, G Influence of conformation on GRIND-based three-dimensional quantitative structure-activity relationship (3D-QSAR). J Med Chem50:5039-42 (2007) 
 
Lanosterol synthase
Name:Lanosterol synthase
Type:PROTEIN
Mol. Mass.:83309.32
Organism:Homo sapiens (Human)
Description:ChEMBL_11231
Residue:732
BDBM50130788
NameBDBM50130788
Synonyms:CHEMBL116705 {4-[6-(Allyl-methyl-amino)-hexyloxy]-2-methylamino-phenyl}-(4-bromo-phenyl)-methanone; fumarate
TypeSmall organic molecule
Emp. Form.C24H31BrN2O2
Mol. Mass.459.419
SMILESCNc1cc(OCCCCCCN(C)CC=C)ccc1C(=O)c1ccc(Br)cc1