Reaction Details
TargetCannabinoid receptor 1
LigandBDBM50423212
Substrate/Competitorn/a
Meas. Tech.ChEMBL_453004 (CHEMBL901144)
IC50 6310±n/a nM
Citation Lambeng, NLebon, FChristophe, BBurton, MDe Ryck, MQuéré, L Arylsulfonamides as a new class of cannabinoid CB1 receptor ligands: identification of a lead and initial SAR studies. Bioorg Med Chem Lett17:272-7 (2006) 
 
Cannabinoid receptor 1
Name:Cannabinoid receptor 1
Type:G Protein-Coupled Receptor (GPCR)
Mol. Mass.:52868.96
Organism:Homo sapiens (Human)
Description:P21554
Residue:472
BDBM50423212
NameBDBM50423212
Synonyms:CHEMBL248345
TypeSmall organic molecule
Emp. Form.C18H20N2O3S
Mol. Mass.344.428
SMILESCc1ccc(cc1S(=O)(=O)N1CCCC1)C(=O)Nc1ccccc1