Reaction Details
TargetCannabinoid receptor 1
LigandBDBM70185
Substrate/Competitorn/a
Meas. Tech.ChEMBL_453004 (CHEMBL901144)
IC50 3162±n/a nM
Citation Lambeng, NLebon, FChristophe, BBurton, MDe Ryck, MQuéré, L Arylsulfonamides as a new class of cannabinoid CB1 receptor ligands: identification of a lead and initial SAR studies. Bioorg Med Chem Lett17:272-7 (2006) 
 
Cannabinoid receptor 1
Name:Cannabinoid receptor 1
Type:G Protein-Coupled Receptor (GPCR)
Mol. Mass.:52868.96
Organism:Homo sapiens (Human)
Description:P21554
Residue:472
BDBM70185
NameBDBM70185
Synonyms:4-methyl-N-(5-methyl-2-pyridinyl)-3-(1-piperidinylsulfonyl)benzamide 4-methyl-N-(5-methylpyridin-2-yl)-3-piperidin-1-ylsulfonyl-benzamide MLS001078236 cid_18106804
TypeSmall organic molecule
Emp. Form.C19H23N3O3S
Mol. Mass.373.469
SMILESCc1ccc(NC(=O)c2ccc(C)c(c2)S(=O)(=O)N2CCCCC2)nc1