Reaction Details
TargetCannabinoid receptor 1
LigandBDBM50423214
Substrate/Competitorn/a
Meas. Tech.ChEMBL_453004 (CHEMBL901144)
IC50 398±n/a nM
Citation Lambeng, NLebon, FChristophe, BBurton, MDe Ryck, MQuéré, L Arylsulfonamides as a new class of cannabinoid CB1 receptor ligands: identification of a lead and initial SAR studies. Bioorg Med Chem Lett17:272-7 (2006) 
 
Cannabinoid receptor 1
Name:Cannabinoid receptor 1
Type:G Protein-Coupled Receptor (GPCR)
Mol. Mass.:52868.96
Organism:Homo sapiens (Human)
Description:P21554
Residue:472
BDBM50423214
NameBDBM50423214
Synonyms:CHEMBL427873
TypeSmall organic molecule
Emp. Form.C21H19ClN2O4S
Mol. Mass.430.905
SMILESClc1ccc(NC(=O)c2cccc3ccccc23)cc1S(=O)(=O)N1CCOCC1