Reaction Details
TargetCannabinoid receptor 1
LigandBDBM50423215
Substrate/Competitorn/a
Meas. Tech.ChEMBL_453004 (CHEMBL901144)
IC50 5012±n/a nM
Citation Lambeng, NLebon, FChristophe, BBurton, MDe Ryck, MQuéré, L Arylsulfonamides as a new class of cannabinoid CB1 receptor ligands: identification of a lead and initial SAR studies. Bioorg Med Chem Lett17:272-7 (2006) 
 
Cannabinoid receptor 1
Name:Cannabinoid receptor 1
Type:G Protein-Coupled Receptor (GPCR)
Mol. Mass.:52868.96
Organism:Homo sapiens (Human)
Description:P21554
Residue:472
BDBM50423215
NameBDBM50423215
Synonyms:CHEMBL246093
TypeSmall organic molecule
Emp. Form.C18H21N3O3S
Mol. Mass.359.443
SMILESNc1cccc(NC(=O)c2cccc(c2)S(=O)(=O)N2CCCCC2)c1