Reaction Details
TargetC-C chemokine receptor type 8
LigandBDBM50423245
Substrate/Competitorn/a
Meas. Tech.ChEMBL_454278 (CHEMBL903462)
IC50 6310±n/a nM
Citation Jin, JWang, YWang, FKerns, JKVinader, VMHancock, APLindon, MJStevenson, GIMorrow, DMRao, PNguyen, CBarrett, VJBrowning, CHartmann, GAndrew, DPSarau, HMFoley, JJJurewicz, AJFornwald, JAHarker, AJMoore, MLRivero, RABelmonte, KEConnor, HE Oxazolidinones as novel human CCR8 antagonists. Bioorg Med Chem Lett17:1722-5 (2007) 
 
C-C chemokine receptor type 8
Name:C-C chemokine receptor type 8
Type:PROTEIN
Mol. Mass.:40855.53
Organism:Homo sapiens (Human)
Description:ChEMBL_454278
Residue:355
BDBM50423245
NameBDBM50423245
Synonyms:CHEMBL240249
TypeSmall organic molecule
Emp. Form.C26H28N4O3
Mol. Mass.444.5255
SMILESCOc1ccc2nccc(C3CN(CCCN(C)Cc4cc5ccccc5[nH]4)C(=O)O3)c2c1