Reaction Details
TargetC-C chemokine receptor type 8
LigandBDBM50423251
Substrate/Competitorn/a
Meas. Tech.ChEMBL_454278 (CHEMBL903462)
IC50 32±n/a nM
Citation Jin, JWang, YWang, FKerns, JKVinader, VMHancock, APLindon, MJStevenson, GIMorrow, DMRao, PNguyen, CBarrett, VJBrowning, CHartmann, GAndrew, DPSarau, HMFoley, JJJurewicz, AJFornwald, JAHarker, AJMoore, MLRivero, RABelmonte, KEConnor, HE Oxazolidinones as novel human CCR8 antagonists. Bioorg Med Chem Lett17:1722-5 (2007) 
 
C-C chemokine receptor type 8
Name:C-C chemokine receptor type 8
Type:PROTEIN
Mol. Mass.:40855.53
Organism:Homo sapiens (Human)
Description:ChEMBL_454278
Residue:355
BDBM50423251
NameBDBM50423251
Synonyms:CHEMBL240461
TypeSmall organic molecule
Emp. Form.C26H27N5O3
Mol. Mass.457.5243
SMILESCOc1ccc2nccc(C3CN(C4CCN(Cc5cc6ccccc6[nH]5)CC4)C(=O)O3)c2n1