Reaction Details
TargetP2Y purinoceptor 12
LigandBDBM50423388
Substrate/Competitorn/a
Meas. Tech.ChEMBL_457631 (CHEMBL923908)
IC50 0.32±n/a nM
Citation Springthorpe, BBailey, ABarton, PBirkinshaw, TNBonnert, RVBrown, RCChapman, DDixon, JGuile, SDHumphries, RGHunt, SFInce, FIngall, AHKirk, IPLeeson, PDLeff, PLewis, RJMartin, BPMcGinnity, DFMortimore, MPPaine, SWPairaudeau, GPatel, ARigby, AJRiley, RJTeobald, BJTomlinson, WWebborn, PJWillis, PA From ATP to AZD6140: the discovery of an orally active reversible P2Y12 receptor antagonist for the prevention of thrombosis. Bioorg Med Chem Lett17:6013-8 (2007) 
 
P2Y purinoceptor 12
Name:P2Y purinoceptor 12
Type:Enzyme
Mol. Mass.:39458.48
Organism:Homo sapiens (Human)
Description:Q9H244
Residue:342
BDBM50423388
NameBDBM50423388
Synonyms:CHEMBL251024
TypeSmall organic molecule
Emp. Form.C22H31N7O8S
Mol. Mass.553.589
SMILESCCCCNc1nc(SCCC)nc2n(nnc12)[C@@H]1O[C@H](\C=C\C(=O)N[C@@H](CC(O)=O)C(O)=O)[C@@H](O)[C@H]1O